BDBM50285074 3-(10,11-Dihydro-5H-dibenzo[a,d]cyclohepten-5-yl)-4-methoxy-benzene-1,2-diol::CHEMBL58290
SMILES COc1ccc(O)c(O)c1C1c2ccccc2CCc2ccccc12
InChI Key InChIKey=XWXPYTYUGSDJJU-UHFFFAOYSA-N
Data  1 IC50
  Tab Delimited (TSV)   2D SDfile   Computed 3D by Vconf -m prep SDfile
Find this compound or compounds like it in BindingDB:
Activity Spreadsheet -- Enzyme Inhibition Constant Data from BindingDB
Found 1 hit for monomerid = 50285074
TargetCholesteryl ester transfer protein(Homo sapiens (Human))
TBA
Curated by ChEMBL
LigandPNGBDBM50285074(3-(10,11-Dihydro-5H-dibenzo[a,d]cyclohepten-5-yl)-...)
Affinity DataIC50:  2.00E+3nM. Assay description: Inhibition of Cholesterol ester transfer protein (CETP)
In DepthDetails Article