BDBM50285402 CHEMBL4173627
SMILES CCOc1ccc(Cc2cc(ccc2Cl)[C@@H]2O[C@H](CNOC)[C@@H](O)[C@H](O)[C@H]2O)cc1
InChI Key InChIKey=XFEYKYIUDLHUCJ-BDHVOXNPSA-N
Data  2 EC50
  Tab Delimited (TSV)   2D SDfile   Computed 3D by Vconf -m prep SDfile
Find this compound or compounds like it in BindingDB:
Activity Spreadsheet -- Enzyme Inhibition Constant Data from BindingDB
Found 2 hits for monomerid = 50285402
TargetSodium/glucose cotransporter 1(Homo sapiens (Human))
National Health Research Institutes
Curated by ChEMBL
LigandPNGBDBM50285402(CHEMBL4173627)
Affinity DataEC50:  5.39E+3nM. Assay description: Inhibition of human SGLT1 expressed in CHO cells assessed as reduction in [14C]AMG uptake after 1 hr by microbeta counting method
In DepthDetails ArticlePubMed
TargetSodium/glucose cotransporter 2(Homo sapiens (Human))
National Health Research Institutes
Curated by ChEMBL
LigandPNGBDBM50285402(CHEMBL4173627)
Affinity DataEC50:  63nM. Assay description: Inhibition of human SGLT2 expressed in CHO cells assessed as reduction in [14C]AMG uptake after 1 hr by microbeta counting method
In DepthDetails ArticlePubMed