BDBM50287473 3,3,4,4,4-Pentafluoro-1-((2S,4aS,8aS)-4a-methyl-decahydro-naphthalen-2-yl)-butan-2-one::CHEMBL417184
SMILES C[C@@]12CCCC[C@H]1C[C@@H](CC(=O)C(F)(F)C(F)(F)F)CC2
InChI Key InChIKey=QUZXPYVCZFSMAJ-GVXVVHGQSA-N
Data  1 IC50
  Tab Delimited (TSV)   2D SDfile   Computed 3D by Vconf -m prep SDfile
Find this compound or compounds like it in BindingDB:
Activity Spreadsheet -- Enzyme Inhibition Constant Data from BindingDB
Found 1 hit for monomerid = 50287473
TargetLysosomal acid lipase/cholesteryl ester hydrolase(Homo sapiens (Human))
TBA
Curated by ChEMBL
LigandPNGBDBM50287473(3,3,4,4,4-Pentafluoro-1-((2S,4aS,8aS)-4a-methyl-de...)
Affinity DataIC50:  1.00E+4nM. Assay description: Inhibition of ancreatic cholesterol esterase using using p-nitrophenylacetate or cholesteryl [1-14C]-oleate as substrates
In DepthDetails Article