BDBM50287843 (S)-2-Phenoxymethyl-azetidine::CHEMBL72031
SMILES C(Oc1ccccc1)[C@@H]1CCN1
InChI Key InChIKey=HQEFJGXPIXHFQT-VIFPVBQESA-N
Data  1 KI
  Tab Delimited (TSV)   2D SDfile   Computed 3D by Vconf -m prep SDfile
Find this compound or compounds like it in BindingDB:
Activity Spreadsheet -- Enzyme Inhibition Constant Data from BindingDB
Found 1 hit for monomerid = 50287843
TargetNeuronal acetylcholine receptor subunit alpha-10(Rattus norvegicus)
TBA
Curated by ChEMBL
LigandPNGBDBM50287843((S)-2-Phenoxymethyl-azetidine | CHEMBL72031)
Affinity DataKi:  52nM. Assay description: Binding affinity against neuronal nicotinic acetylcholine receptor(nAChR) by using [3H]-Cytisine as radioligand in whole rat brain
In DepthDetails Article