BDBM50287854 (R)-2-(3-Fluoro-phenoxymethyl)-1-methyl-pyrrolidine::CHEMBL72197
SMILES CN1CCC[C@@H]1COc1cccc(F)c1
InChI Key InChIKey=YMSPBBGEZQILFC-LLVKDONJSA-N
Data  1 KI
  Tab Delimited (TSV)   2D SDfile   Computed 3D by Vconf -m prep SDfile
Find this compound or compounds like it in BindingDB:
Activity Spreadsheet -- Enzyme Inhibition Constant Data from BindingDB
Found 1 hit for monomerid = 50287854
TargetNeuronal acetylcholine receptor subunit alpha-10(Rattus norvegicus)
TBA
Curated by ChEMBL
LigandPNGBDBM50287854((R)-2-(3-Fluoro-phenoxymethyl)-1-methyl-pyrrolidin...)
Affinity DataKi:  78nM. Assay description: Binding affinity against neuronal nicotinic acetylcholine receptor(nAChR) by using [3H]-Cytisine as radioligand in whole rat brain
In DepthDetails Article