BDBM50288820 (S)-2-{(S)-4-[4-(2,4-Diamino-pyrimidin-5-yl)-butyl]-benzoylamino}-pentanedioic acid::CHEMBL145947::LY-298207
SMILES Nc1ncc(CCCCc2ccc(cc2)C(=O)N[C@@H](CCC(O)=O)C(O)=O)c(N)n1
InChI Key InChIKey=NZYUNEWFXVDLPE-UHFFFAOYSA-N
Data  2 KI
  Tab Delimited (TSV)   2D SDfile   Computed 3D by Vconf -m prep SDfile
Find this compound or compounds like it in BindingDB:
Activity Spreadsheet -- Enzyme Inhibition Constant Data from BindingDB
Found 2 hits for monomerid = 50288820
TargetDihydrofolate reductase(Homo sapiens (Human))
TBA
Curated by ChEMBL
LigandPNGBDBM50288820((S)-2-{(S)-4-[4-(2,4-Diamino-pyrimidin-5-yl)-butyl...)
Affinity DataKi:  0.00500nM. Assay description: Binding affinity of the compound against Recombinant human dihydrofolate reductase (DHFR)
In DepthDetails Article
TargetThymidylate synthase(Homo sapiens (Human))
TBA
Curated by ChEMBL
LigandPNGBDBM50288820((S)-2-{(S)-4-[4-(2,4-Diamino-pyrimidin-5-yl)-butyl...)
Affinity DataKi: >5.00E+3nM. Assay description: Binding affinity of the compound against Recombinant human thymidylate synthase (TS).
In DepthDetails Article