BDBM50289635 (2E,4E)-2-Methyl-1-[(S)-2-(pyrrolidine-1-carbonyl)-pyrrolidin-1-yl]-octa-2,4-dien-1-one::CHEMBL45668
SMILES CCC\C=C\C=C(/C)C(=O)N1CCC[C@H]1C(=O)N1CCCC1
InChI Key InChIKey=OCAVGNIQTLKFDQ-OPYUBCESSA-N
Data  1 IC50
  Tab Delimited (TSV)   2D SDfile   Computed 3D by Vconf -m prep SDfile
Find this compound or compounds like it in BindingDB:
Activity Spreadsheet -- Enzyme Inhibition Constant Data from BindingDB
Found 1 hit for monomerid = 50289635
TargetProlyl endopeptidase(Rattus norvegicus)
TBA
Curated by ChEMBL
LigandPNGBDBM50289635((2E,4E)-2-Methyl-1-[(S)-2-(pyrrolidine-1-carbonyl)...)
Affinity DataIC50:  207nM. Assay description: Inhibitory activity against rat brain Prolyl endopeptidase (PEP)
In DepthDetails Article