BDBM50289643 1-[(R)-4-(Pyrrolidine-1-carbonyl)-thiazolidin-3-yl]-hexan-1-one::CHEMBL47990
SMILES CCCCCC(=O)N1CSC[C@H]1C(=O)N1CCCC1
InChI Key InChIKey=GDXKWQUHCWPVIF-LBPRGKRZSA-N
Data  1 IC50
  Tab Delimited (TSV)   2D SDfile   Computed 3D by Vconf -m prep SDfile
Find this compound or compounds like it in BindingDB:
Activity Spreadsheet -- Enzyme Inhibition Constant Data from BindingDB
Found 1 hit for monomerid = 50289643
TargetProlyl endopeptidase(Rattus norvegicus)
TBA
Curated by ChEMBL
LigandPNGBDBM50289643(1-[(R)-4-(Pyrrolidine-1-carbonyl)-thiazolidin-3-yl...)
Affinity DataIC50:  37nM. Assay description: Inhibitory activity against rat brain Prolyl endopeptidase (PEP)
In DepthDetails Article