BDBM50291344 CHEMBL4165510
SMILES Fc1cc2CN(C=O)C(Cn3cc(C4=C(C(=O)NC4=O)c4cnc5ccccn45)c(c1)c23)N1CCCCC1
InChI Key InChIKey=FQSLUXJXRWMBDT-UHFFFAOYSA-N
Data  1 IC50
  Tab Delimited (TSV)   2D SDfile   Computed 3D by Vconf -m prep SDfile
Find this compound or compounds like it in BindingDB:
Activity Spreadsheet -- Enzyme Inhibition Constant Data from BindingDB
Found 1 hit for monomerid = 50291344
TargetGlycogen synthase kinase-3 beta(Homo sapiens (Human))
National Institute Of Pharmaceutical Education And Research (Niper)
Curated by ChEMBL
LigandPNGBDBM50291344(CHEMBL4165510)
Affinity DataIC50:  1.10nM. Assay description: Inhibition of recombinant GSK3-beta (unknown origin) assessed as decrease in phosphorylation of CREB at serine-129 in presence of ATP[gamma-33P] by f...
In DepthDetails ArticlePubMed