BDBM50295847 (2R,3S,4S,5R,6S)-2-(hydroxymethyl)-6-(5-methyl-1,3,4-oxadiazol-2-yl)tetrahydro-2H-pyran-3,4,5-triol::2-(BETA-D-GLUCOPYRANOSYL)-5-METHYL-1,3,4-OXADIAZOLE::CHEMBL540929
SMILES Cc1nnc(o1)[C@@H]1O[C@H](CO)[C@@H](O)[C@H](O)[C@H]1O
InChI Key InChIKey=HCSFWJQLIPWUFZ-JAJWTYFOSA-N
Data  2 KI
PDB links: 1 PDB ID matches this monomer.
  Tab Delimited (TSV)   2D SDfile   Computed 3D by Vconf -m prep SDfile
Find this compound or compounds like it in BindingDB:
Activity Spreadsheet -- Enzyme Inhibition Constant Data from BindingDB
Found 1 hit for monomerid = 50295847
TargetGlycogen phosphorylase, muscle form(Oryctolagus cuniculus (rabbit))
University Of Debrecen
Curated by ChEMBL
LigandPNGBDBM50295847((2R,3S,4S,5R,6S)-2-(hydroxymethyl)-6-(5-methyl-1,3...)
Affinity DataKi:  1.45E+5nM. Assay description: Inhibition of rabbit muscle glycogen phosphorylase b