BDBM50299803 4-(5-chloro-2-(4-fluorobenzyloxy)phenyl)piperidine::CHEMBL574629
SMILES Fc1ccc(COc2ccc(Cl)cc2C2CCNCC2)cc1
InChI Key InChIKey=NSKFLKQWPVFAAE-UHFFFAOYSA-N
Data  4 KI
  Tab Delimited (TSV)   2D SDfile   Computed 3D by Vconf -m prep SDfile
Find this compound or compounds like it in BindingDB:
Activity Spreadsheet -- Enzyme Inhibition Constant Data from BindingDB
Found 4 hits for monomerid = 50299803
TargetSodium-dependent noradrenaline transporter(Homo sapiens (Human))
Pfizer
Curated by ChEMBL
LigandPNGBDBM50299803(4-(5-chloro-2-(4-fluorobenzyloxy)phenyl)piperidine...)
Affinity DataKi:  6nM. Assay description: Displacement of [125I]RTI-55 from human NET expressed in HEK293 cells
In DepthDetails ArticlePubMed
TargetSodium-dependent serotonin transporter(Homo sapiens (Human))
Pfizer
Curated by ChEMBL
LigandPNGBDBM50299803(4-(5-chloro-2-(4-fluorobenzyloxy)phenyl)piperidine...)
Affinity DataKi:  40nM. Assay description: Displacement of [125I]RTI-55 from human SERT expressed in HEK293 cells
In DepthDetails ArticlePubMed
Target5-hydroxytryptamine receptor 1A(Homo sapiens (Human))
Pfizer
Curated by ChEMBL
LigandPNGBDBM50299803(4-(5-chloro-2-(4-fluorobenzyloxy)phenyl)piperidine...)
Affinity DataKi: >1.00E+3nM. Assay description: Displacement of [3H]8-OH-DPAT from human 5HT1A receptor expressed in CHO cells
In DepthDetails ArticlePubMed
TargetSodium-dependent dopamine transporter(Homo sapiens (Human))
Pfizer
Curated by ChEMBL
LigandPNGBDBM50299803(4-(5-chloro-2-(4-fluorobenzyloxy)phenyl)piperidine...)
Affinity DataKi:  5.53E+3nM. Assay description: Displacement of [125I]RTI-55 from human DAT expressed in HEK293 cells
In DepthDetails ArticlePubMed