BDBM50301396 CHEMBL572034::Phenyl-[1-(4-p-tolyl-butyl)-piperidin-4-yl]-methanol
SMILES Cc1ccc(CCCCN2CCC(CC2)C(O)c2ccccc2)cc1
InChI Key InChIKey=RGGWURWNJUDTIH-UHFFFAOYSA-N
Data  1 KI
  Tab Delimited (TSV)   2D SDfile   Computed 3D by Vconf -m prep SDfile
Find this compound or compounds like it in BindingDB:
Activity Spreadsheet -- Enzyme Inhibition Constant Data from BindingDB
Found 1 hit for monomerid = 50301396
TargetHistamine H1 receptor(Homo sapiens (Human))
The Schering Plough Research Institute
Curated by ChEMBL
LigandPNGBDBM50301396(CHEMBL572034 | Phenyl-[1-(4-p-tolyl-butyl)-piperid...)
Affinity DataKi:  121nM. Assay description: Displacement of [3H]pyrilamine from human recombinant histamine H1 receptor expressed in CHO cell by betaplate scintillation counting
In DepthDetails ArticlePubMed