BDBM50301398 CHEMBL571391::Diphenyl-[1-(2-p-tolyl-ethyl)-piperidin-4-yl]-methanol
SMILES Cc1ccc(CCN2CCC(CC2)C(O)(c2ccccc2)c2ccccc2)cc1
InChI Key InChIKey=JCHIUKROMYHWKE-UHFFFAOYSA-N
Data  1 KI
  Tab Delimited (TSV)   2D SDfile   Computed 3D by Vconf -m prep SDfile
Find this compound or compounds like it in BindingDB:
Activity Spreadsheet -- Enzyme Inhibition Constant Data from BindingDB
Found 1 hit for monomerid = 50301398
TargetHistamine H1 receptor(Homo sapiens (Human))
The Schering Plough Research Institute
Curated by ChEMBL
LigandPNGBDBM50301398(CHEMBL571391 | Diphenyl-[1-(2-p-tolyl-ethyl)-piper...)
Affinity DataKi:  64nM. Assay description: Displacement of [3H]pyrilamine from human recombinant histamine H1 receptor expressed in CHO cell by betaplate scintillation counting
In DepthDetails ArticlePubMed