BDBM50303967 (E)-3-(3-Chloro-1,4-naphthoquinon-2-yl)-2-methylpropenoic Acid::CHEMBL568994
SMILES C\C(=C/C1=C(Cl)C(=O)c2ccccc2C1=O)C(O)=O
InChI Key InChIKey=IEEMCGPTKHURAP-VOTSOKGWSA-N
Data  1 IC50
  Tab Delimited (TSV)   2D SDfile   Computed 3D by Vconf -m prep SDfile
Find this compound or compounds like it in BindingDB:
Activity Spreadsheet -- Enzyme Inhibition Constant Data from BindingDB
Found 1 hit for monomerid = 50303967
TargetDNA-(apurinic or apyrimidinic site) endonuclease(Homo sapiens (Human))
Purdue University
Curated by ChEMBL
LigandPNGBDBM50303967((E)-3-(3-Chloro-1,4-naphthoquinon-2-yl)-2-methylpr...)
Affinity DataIC50:  1.00E+3nM. Assay description: Inhibition of Ape1/ref-1 redox activity in presence of 0.02 mM DTT and human Hey-C2 cells nuclear extracts by EMSA
In DepthDetails ArticlePubMed