BDBM50304166 CHEMBL593447::S-(3,5-Dideoxy-3-fluoro-D-xylofuranos-5-yl)-L-homocysteine
SMILES N[C@@H](CCSC[C@H]1OC(O)[C@H](O)[C@H]1F)C(O)=O
InChI Key InChIKey=PXNSHTCESFYLEA-VYERIXCVSA-N
Data  2 KI
  Tab Delimited (TSV)   2D SDfile   Computed 3D by Vconf -m prep SDfile
Find this compound or compounds like it in BindingDB:
Activity Spreadsheet -- Enzyme Inhibition Constant Data from BindingDB
Found 2 hits for monomerid = 50304166
TargetS-ribosylhomocysteine lyase(Bacillus subtilis)
Florida International University
Curated by ChEMBL
LigandPNGBDBM50304166(CHEMBL593447 | S-(3,5-Dideoxy-3-fluoro-D-xylofuran...)
Affinity DataKi:  2.80E+3nM. Assay description: Inhibition of Bacillus subtilis LuxS assessed as enzyme-inhibitor dissociation constant
In DepthDetails ArticlePubMed
TargetS-ribosylhomocysteine lyase(Bacillus subtilis)
Florida International University
Curated by ChEMBL
LigandPNGBDBM50304166(CHEMBL593447 | S-(3,5-Dideoxy-3-fluoro-D-xylofuran...)
Affinity DataKi:  7.70E+3nM. Assay description: Inhibition of Bacillus subtilis LuxS
In DepthDetails ArticlePubMed