BDBM50305143 7-(2-amino-2-oxoethoxy)-2-(4-phenoxyphenyl)-9,10-dihydro-4H-benzo[d]pyrazolo[1,5-a][1,3]diazepine-3-carboxamide::CHEMBL603737
SMILES NC(=O)COc1ccc2Nc3c(C(N)=O)c(nn3CCc2c1)-c1ccc(Oc2ccccc2)cc1
InChI Key InChIKey=AVNIJFADOORZIO-UHFFFAOYSA-N
Data  1 IC50
  Tab Delimited (TSV)   2D SDfile   Computed 3D by Vconf -m prep SDfile
Find this compound or compounds like it in BindingDB:
Activity Spreadsheet -- Enzyme Inhibition Constant Data from BindingDB
Found 1 hit for monomerid = 50305143
TargetTyrosine-protein kinase Lck(Homo sapiens (Human))
Taisho Pharmaceutical
Curated by ChEMBL
LigandPNGBDBM50305143(7-(2-amino-2-oxoethoxy)-2-(4-phenoxyphenyl)-9,10-d...)
Affinity DataIC50:  1.20nM. Assay description: Inhibition of GST-tagged human LCK by scintillation counting
In DepthDetails ArticlePubMed