BDBM50305558 CHEMBL594444::N-(5-bromothiazol-2-ylcarbamoyl)-4-(2-methoxythiazol-4-yl)-3-methylbenzenesulfonamide
SMILES COc1nc(cs1)-c1ccc(cc1C)S(=O)(=O)NC(=O)Nc1ncc(Br)s1
InChI Key InChIKey=VBEKOCDGOZPIRV-UHFFFAOYSA-N
Data  2 IC50  1 EC50
  Tab Delimited (TSV)   2D SDfile   Computed 3D by Vconf -m prep SDfile
Find this compound or compounds like it in BindingDB:
Activity Spreadsheet -- Enzyme Inhibition Constant Data from BindingDB
Found 3 hits for monomerid = 50305558
TargetFructose-1,6-bisphosphatase 1(Homo sapiens (Human))
F. Hoffmann-La Roche
Curated by ChEMBL
LigandPNGBDBM50305558(CHEMBL594444 | N-(5-bromothiazol-2-ylcarbamoyl)-4-...)
Affinity DataIC50:  320nM. Assay description: Inhibition of FBPase in human liver
In DepthDetails ArticlePubMed
TargetFructose-1,6-bisphosphatase 1(Mus musculus)
F. Hoffmann-La Roche
Curated by ChEMBL
LigandPNGBDBM50305558(CHEMBL594444 | N-(5-bromothiazol-2-ylcarbamoyl)-4-...)
Affinity DataEC50:  6.20E+4nM. Assay description: Inhibition of FBPase in mouse liver
In DepthDetails ArticlePubMed
TargetFructose-1,6-bisphosphatase 1(Homo sapiens (Human))
F. Hoffmann-La Roche
Curated by ChEMBL
LigandPNGBDBM50305558(CHEMBL594444 | N-(5-bromothiazol-2-ylcarbamoyl)-4-...)
Affinity DataIC50:  90nM. Assay description: Inhibition of FBPase in human liver using fructose-2,6phosphate as a substrate
In DepthDetails ArticlePubMed