BDBM50305576 CHEMBL601267::N-(5-bromothiazol-2-ylcarbamoyl)-7-(2-hydroxyethoxy)-1-methyl-1H-indole-3-sulfonamide
SMILES Cn1cc(c2cccc(OCCO)c12)S(=O)(=O)NC(=O)Nc1ncc(Br)s1
InChI Key InChIKey=DVSJWUQOJNQBRA-UHFFFAOYSA-N
Data  1 IC50  1 EC50
  Tab Delimited (TSV)   2D SDfile   Computed 3D by Vconf -m prep SDfile
Find this compound or compounds like it in BindingDB:
Activity Spreadsheet -- Enzyme Inhibition Constant Data from BindingDB
Found 2 hits for monomerid = 50305576
TargetFructose-1,6-bisphosphatase 1(Mus musculus)
F. Hoffmann-La Roche
Curated by ChEMBL
LigandPNGBDBM50305576(CHEMBL601267 | N-(5-bromothiazol-2-ylcarbamoyl)-7-...)
Affinity DataEC50:  6.30E+3nM. Assay description: Inhibition of FBPase in mouse liver
In DepthDetails ArticlePubMed
TargetFructose-1,6-bisphosphatase 1(Homo sapiens (Human))
F. Hoffmann-La Roche
Curated by ChEMBL
LigandPNGBDBM50305576(CHEMBL601267 | N-(5-bromothiazol-2-ylcarbamoyl)-7-...)
Affinity DataIC50:  100nM. Assay description: Inhibition of FBPase in human liver
In DepthDetails ArticlePubMed