BDBM50305587 CHEMBL589137::N-(5-bromothiazol-2-ylcarbamoyl)-3-ethylbenzenesulfonamide::N-[(5-bromo-1,3-thiazol-2-yl)carbamoyl]-3-ethylbenzenesulfonamide
SMILES CCc1cccc(c1)S(=O)(=O)NC(=O)Nc1ncc(Br)s1
InChI Key InChIKey=CDARLLLKPJHKBU-UHFFFAOYSA-N
Data  2 IC50  1 EC50
PDB links: 1 PDB ID matches this monomer.
  Tab Delimited (TSV)   2D SDfile   Computed 3D by Vconf -m prep SDfile
Find this compound or compounds like it in BindingDB:
Activity Spreadsheet -- Enzyme Inhibition Constant Data from BindingDB
Found 3 hits for monomerid = 50305587
TargetFructose-1,6-bisphosphatase 1(Homo sapiens (Human))
F. Hoffmann-La Roche
Curated by ChEMBL
LigandPNGBDBM50305587(CHEMBL589137 | N-(5-bromothiazol-2-ylcarbamoyl)-3-...)
Affinity DataIC50:  100nM. Assay description: Inhibition of FBPase in human liver using fructose-2,6phosphate as a substrate
TargetFructose-1,6-bisphosphatase 1(Mus musculus)
F. Hoffmann-La Roche
Curated by ChEMBL
LigandPNGBDBM50305587(CHEMBL589137 | N-(5-bromothiazol-2-ylcarbamoyl)-3-...)
Affinity DataEC50:  3.20E+4nM. Assay description: Inhibition of FBPase in mouse liver
TargetFructose-1,6-bisphosphatase 1(Homo sapiens (Human))
F. Hoffmann-La Roche
Curated by ChEMBL
LigandPNGBDBM50305587(CHEMBL589137 | N-(5-bromothiazol-2-ylcarbamoyl)-3-...)
Affinity DataIC50:  230nM. Assay description: Inhibition of FBPase in human liver