BDBM50305750 3-(4-(2-ethylphenoxy)piperidin-1-yl)-6-(1H-imidazol-1-yl)pyridazine::CHEMBL608863
SMILES CCc1ccccc1OC1CCN(CC1)c1ccc(nn1)-n1ccnc1
InChI Key InChIKey=OGCILDQEMFKUAN-UHFFFAOYSA-N
Data  1 IC50
  Tab Delimited (TSV)   2D SDfile   Computed 3D by Vconf -m prep SDfile
Find this compound or compounds like it in BindingDB:
Activity Spreadsheet -- Enzyme Inhibition Constant Data from BindingDB
Found 1 hit for monomerid = 50305750
TargetAcyl-CoA desaturase 1(Rattus norvegicus (Rat))
Merck Frosst Centre For Therapeutic Research
Curated by ChEMBL
LigandPNGBDBM50305750(3-(4-(2-ethylphenoxy)piperidin-1-yl)-6-(1H-imidazo...)
Affinity DataIC50:  4nM. Assay description: Inhibition of SCD1 in rat liver microsomes
In DepthDetails ArticlePubMed