BDBM50306354 4-methyl-2-(4-methylsulfonyl)phenyl)-3-phenylquinoline::CHEMBL598331
SMILES Cc1c(-c2ccccc2)c(nc2ccccc12)-c1ccc(cc1)S(C)(=O)=O
InChI Key InChIKey=XQCBMHKEPWWBCB-UHFFFAOYSA-N
Data  2 IC50
  Tab Delimited (TSV)   2D SDfile   Computed 3D by Vconf -m prep SDfile
Find this compound or compounds like it in BindingDB:
Activity Spreadsheet -- Enzyme Inhibition Constant Data from BindingDB
Found 2 hits for monomerid = 50306354
TargetProstaglandin G/H synthase 2(Ovis aries (Sheep))
Shahid Beheshti University Mc
Curated by ChEMBL
LigandPNGBDBM50306354(4-methyl-2-(4-methylsulfonyl)phenyl)-3-phenylquino...)
Affinity DataIC50:  110nM. Assay description: Inhibition of ovine COX2 by enzyme chemiluminescent enzyme assay
In DepthDetails ArticlePubMed
TargetProstaglandin G/H synthase 1(Ovis aries (Sheep))
Shahid Beheshti University Mc
Curated by ChEMBL
LigandPNGBDBM50306354(4-methyl-2-(4-methylsulfonyl)phenyl)-3-phenylquino...)
Affinity DataIC50:  1.33E+4nM. Assay description: Inhibition of ovine COX1 by enzyme chemiluminescent enzyme assay
In DepthDetails ArticlePubMed