BDBM50309080 (S)-2-((2S,4R)-1-(3-cyanophenylsulfonyl)-4-(1H-1,2,4-triazol-1-yl)pyrrolidine-2-carboxamido)-3-(4-(3,5-dichloroisonicotinamido)phenyl)propanoic acid::CHEMBL601469
SMILES OC(=O)[C@H](Cc1ccc(NC(=O)c2c(Cl)cncc2Cl)cc1)NC(=O)[C@@H]1C[C@H](CN1S(=O)(=O)c1cccc(c1)C#N)n1cncn1
InChI Key InChIKey=SRARTUKACIVLMP-YNJKOYDBSA-N
Data  1 IC50
  Tab Delimited (TSV)   2D SDfile   Computed 3D by Vconf -m prep SDfile
Find this compound or compounds like it in BindingDB:
Activity Spreadsheet -- Enzyme Inhibition Constant Data from BindingDB
Found 1 hit for monomerid = 50309080
TargetIntegrin alpha-4(Homo sapiens (Human))
Merck Research Laboratories
Curated by ChEMBL
LigandPNGBDBM50309080((S)-2-((2S,4R)-1-(3-cyanophenylsulfonyl)-4-(1H-1,2...)
Affinity DataIC50:  0.550nM. Assay description: Inhibition of human VLA4
In DepthDetails ArticlePubMed