BDBM50309096 (S)-2-((2S,4R)-1-(3-cyanophenylsulfonyl)-4-(3,3-dimethylpiperidin-1-yl)pyrrolidine-2-carboxamido)-3-(4-(3,5-dichloroisonicotinamido)phenyl)propanoic acid::CHEMBL589750
SMILES CC1(C)CCCN(C1)[C@@H]1C[C@H](N(C1)S(=O)(=O)c1cccc(c1)C#N)C(=O)N[C@@H](Cc1ccc(NC(=O)c2c(Cl)cncc2Cl)cc1)C(O)=O
InChI Key InChIKey=MOLSBIJQBRSJQZ-MHZHKKNFSA-N
Data  2 IC50
  Tab Delimited (TSV)   2D SDfile   Computed 3D by Vconf -m prep SDfile
Find this compound or compounds like it in BindingDB:
Activity Spreadsheet -- Enzyme Inhibition Constant Data from BindingDB
Found 2 hits for monomerid = 50309096
TargetIntegrin alpha-4(Homo sapiens (Human))
Merck Research Laboratories
Curated by ChEMBL
LigandPNGBDBM50309096((S)-2-((2S,4R)-1-(3-cyanophenylsulfonyl)-4-(3,3-di...)
Affinity DataIC50:  0.160nM. Assay description: Inhibition of human VLA4 in presence of 90% human plasma
In DepthDetails ArticlePubMed
TargetIntegrin alpha-4(Homo sapiens (Human))
Merck Research Laboratories
Curated by ChEMBL
LigandPNGBDBM50309096((S)-2-((2S,4R)-1-(3-cyanophenylsulfonyl)-4-(3,3-di...)
Affinity DataIC50:  0.160nM. Assay description: Inhibition of human VLA4
In DepthDetails ArticlePubMed