BDBM50313038 (Z)-4-(2-(3-chlorophenyl)hydrazono)-3-(3-methoxyphenyl)-1H-pyrazol-5(4H)-one::CHEMBL1079968
SMILES COc1cccc(c1)-c1[nH][nH]c(=O)c1N=Nc1cccc(Cl)c1
InChI Key InChIKey=VVNWSAIMEZFRIF-UHFFFAOYSA-N
Data  1 KI
  Tab Delimited (TSV)   2D SDfile   Computed 3D by Vconf -m prep SDfile
Find this compound or compounds like it in BindingDB:
Activity Spreadsheet -- Enzyme Inhibition Constant Data from BindingDB
Found 1 hit for monomerid = 50313038
TargetGlycogen synthase kinase-3 beta(Homo sapiens (Human))
Vertex Pharmaceuticals
Curated by ChEMBL
LigandPNGBDBM50313038((Z)-4-(2-(3-chlorophenyl)hydrazono)-3-(3-methoxyph...)
Affinity DataKi:  8nM. Assay description: Inhibition of GSK3-beta assessed as NADH level after 10 mins by pyruvate kinase/lactate dehydrogenase coupled spectrophotometric assay
In DepthDetails ArticlePubMed