BDBM50314822 2-((3-((2-(4-methoxyphenyl)-5-methyloxazol-4-yl)methoxy)benzyl)(ptolyloxycarbonyl)amino)acetic acid::CHEMBL1090189
SMILES COc1ccc(cc1)-c1nc(COc2cccc(CN(CC(O)=O)C(=O)Oc3ccc(C)cc3)c2)c(C)o1
InChI Key InChIKey=FFHBRHCAYNKEBM-UHFFFAOYSA-N
Data  4 IC50  2 EC50
  Tab Delimited (TSV)   2D SDfile   Computed 3D by Vconf -m prep SDfile
Find this compound or compounds like it in BindingDB:
Activity Spreadsheet -- Enzyme Inhibition Constant Data from BindingDB
Found 6 hits for monomerid = 50314822
TargetPotassium voltage-gated channel subfamily H member 2(Homo sapiens (Human))
Bristol-Myers Squibb
Curated by ChEMBL
LigandPNGBDBM50314822(2-((3-((2-(4-methoxyphenyl)-5-methyloxazol-4-yl)me...)
Affinity DataIC50:  8.60E+3nM. Assay description: Inhibition of human ERG by electrophysiology assay
In DepthDetails ArticlePubMed
TargetPeroxisome proliferator-activated receptor alpha(Homo sapiens (Human))
Bristol-Myers Squibb
Curated by ChEMBL
LigandPNGBDBM50314822(2-((3-((2-(4-methoxyphenyl)-5-methyloxazol-4-yl)me...)
Affinity DataEC50:  15.8nM. Assay description: Agonist activity at human PPARalpha LBD (167-468) expressed in HEK293 cells coexpressing GAL4-DBD by transactivation assay
In DepthDetails ArticlePubMed
TargetPeroxisome proliferator-activated receptor gamma(Homo sapiens (Human))
Bristol-Myers Squibb
Curated by ChEMBL
LigandPNGBDBM50314822(2-((3-((2-(4-methoxyphenyl)-5-methyloxazol-4-yl)me...)
Affinity DataEC50:  1.12E+3nM. Assay description: Agonist activity at human PPARgamma LBD (176-477) expressed in HEK293 cells coexpressing GAL4-DBD by transactivation assay
In DepthDetails ArticlePubMed
TargetPeroxisome proliferator-activated receptor gamma(Homo sapiens (Human))
Bristol-Myers Squibb
Curated by ChEMBL
LigandPNGBDBM50314822(2-((3-((2-(4-methoxyphenyl)-5-methyloxazol-4-yl)me...)
Affinity DataIC50:  873nM. Assay description: Binding affinity to human His-tagged PPARgamma LBD (Q203-Y477) expressed in Escherichia coli BL21 (DE3) by fluorescence polarization assay
In DepthDetails ArticlePubMed
TargetCytochrome P450 2C9(Homo sapiens (Human))
Bristol-Myers Squibb
Curated by ChEMBL
LigandPNGBDBM50314822(2-((3-((2-(4-methoxyphenyl)-5-methyloxazol-4-yl)me...)
Affinity DataIC50:  2.80E+3nM. Assay description: Inhibition of CYP2C9
In DepthDetails ArticlePubMed
TargetPeroxisome proliferator-activated receptor alpha(Homo sapiens (Human))
Bristol-Myers Squibb
Curated by ChEMBL
LigandPNGBDBM50314822(2-((3-((2-(4-methoxyphenyl)-5-methyloxazol-4-yl)me...)
Affinity DataIC50:  375nM. Assay description: Binding affinity to human His-tagged PPARalpha LBD (E196-Y468) expressed in Escherichia coli BL21 (DE3) by fluorescence polarization assay
In DepthDetails ArticlePubMed