BDBM50314828 2-((3-((5-methyl-2-(4-morpholinophenyl)oxazol-4-yl)methoxy)benzyl)(ptolyloxycarbonyl)amino)acetic acid::CHEMBL1089970
SMILES Cc1oc(nc1COc1cccc(CN(CC(O)=O)C(=O)Oc2ccc(C)cc2)c1)-c1ccc(cc1)N1CCOCC1
InChI Key InChIKey=YOQQPFKATOJNLP-UHFFFAOYSA-N
Data  2 IC50  2 EC50
  Tab Delimited (TSV)   2D SDfile   Computed 3D by Vconf -m prep SDfile
Find this compound or compounds like it in BindingDB:
Activity Spreadsheet -- Enzyme Inhibition Constant Data from BindingDB
Found 4 hits for monomerid = 50314828
TargetPeroxisome proliferator-activated receptor alpha(Homo sapiens (Human))
Bristol-Myers Squibb
Curated by ChEMBL
LigandPNGBDBM50314828(2-((3-((5-methyl-2-(4-morpholinophenyl)oxazol-4-yl...)
Affinity DataEC50:  108nM. Assay description: Agonist activity at human PPARalpha LBD (167-468) expressed in HEK293 cells coexpressing GAL4-DBD by transactivation assay
In DepthDetails ArticlePubMed
TargetPeroxisome proliferator-activated receptor gamma(Homo sapiens (Human))
Bristol-Myers Squibb
Curated by ChEMBL
LigandPNGBDBM50314828(2-((3-((5-methyl-2-(4-morpholinophenyl)oxazol-4-yl...)
Affinity DataEC50:  417nM. Assay description: Agonist activity at human PPARgamma LBD (176-477) expressed in HEK293 cells coexpressing GAL4-DBD by transactivation assay
In DepthDetails ArticlePubMed
TargetPeroxisome proliferator-activated receptor gamma(Homo sapiens (Human))
Bristol-Myers Squibb
Curated by ChEMBL
LigandPNGBDBM50314828(2-((3-((5-methyl-2-(4-morpholinophenyl)oxazol-4-yl...)
Affinity DataIC50:  1.19E+3nM. Assay description: Binding affinity to human His-tagged PPARgamma LBD (Q203-Y477) expressed in Escherichia coli BL21 (DE3) by fluorescence polarization assay
In DepthDetails ArticlePubMed
TargetPeroxisome proliferator-activated receptor alpha(Homo sapiens (Human))
Bristol-Myers Squibb
Curated by ChEMBL
LigandPNGBDBM50314828(2-((3-((5-methyl-2-(4-morpholinophenyl)oxazol-4-yl...)
Affinity DataIC50:  1.73E+3nM. Assay description: Binding affinity to human His-tagged PPARalpha LBD (E196-Y468) expressed in Escherichia coli BL21 (DE3) by fluorescence polarization assay
In DepthDetails ArticlePubMed