BDBM50315540 8-(2-Thioxo-7(3-butyl)-2-(2-furyl),thiazolo,[4,3-e]1,2,4-triazolo[1,5-c]pyrimidine::CHEMBL1092270
SMILES CCCCn1c2ncn3nc(nc3c2sc1=S)-c1ccco1
InChI Key InChIKey=QHFYRCHXHNWYCV-UHFFFAOYSA-N
Data  2 KI
  Tab Delimited (TSV)   2D SDfile   Computed 3D by Vconf -m prep SDfile
Find this compound or compounds like it in BindingDB:
Activity Spreadsheet -- Enzyme Inhibition Constant Data from BindingDB
Found 2 hits for monomerid = 50315540
TargetAdenosine receptor A2a(Homo sapiens (Human))
University Of Delhi
Curated by ChEMBL
LigandPNGBDBM50315540(8-(2-Thioxo-7(3-butyl)-2-(2-furyl),thiazolo,[4,3-e...)
Affinity DataKi:  0.120nM. Assay description: Displacement of [3H]ZM241385 from human adenosine A2A receptor expressed in HEK293 cells after 60 mins by rapid filtration assay
In DepthDetails ArticlePubMed
TargetAdenosine receptor A1(Homo sapiens (Human))
University Of Delhi
Curated by ChEMBL
LigandPNGBDBM50315540(8-(2-Thioxo-7(3-butyl)-2-(2-furyl),thiazolo,[4,3-e...)
Affinity DataKi:  148nM. Assay description: Displacement of [3H]DPCPX from human adenosine A1 receptor expressed in HEK293 cells after 60 mins by rapid filtration assay
In DepthDetails ArticlePubMed