BDBM50318691 4-(Piperidin-1-yl)-1,2,5-thiadiazol-3-yl piperidine-1-carboxylate::CHEMBL1085857
SMILES O=C(Oc1nsnc1N1CCCCC1)N1CCCCC1
InChI Key InChIKey=PNYYVHOTXOEBEV-UHFFFAOYSA-N
Data  1 IC50
  Tab Delimited (TSV)   2D SDfile   Computed 3D by Vconf -m prep SDfile
Find this compound or compounds like it in BindingDB:
Activity Spreadsheet -- Enzyme Inhibition Constant Data from BindingDB
Found 1 hit for monomerid = 50318691
TargetLysosomal acid lipase/cholesteryl ester hydrolase(Homo sapiens (Human))
Weill Cornell Medical College
Curated by ChEMBL
LigandPNGBDBM50318691(4-(Piperidin-1-yl)-1,2,5-thiadiazol-3-yl piperidin...)
Affinity DataIC50:  152nM. Assay description: Inhibition of human LAL after 30 mins by fluorescence assay
In DepthDetails ArticlePubMed