BDBM50318693 4-(Pyrrolidin-1-yl)-1,2,5-thiadiazol-3-yl Piperidine-1-carboxylate::CHEMBL1085855
SMILES O=C(Oc1nsnc1N1CCCC1)N1CCCCC1
InChI Key InChIKey=AZYYMSCKADOXME-UHFFFAOYSA-N
Data  1 IC50
  Tab Delimited (TSV)   2D SDfile   Computed 3D by Vconf -m prep SDfile
Find this compound or compounds like it in BindingDB:
Activity Spreadsheet -- Enzyme Inhibition Constant Data from BindingDB
Found 1 hit for monomerid = 50318693
TargetLysosomal acid lipase/cholesteryl ester hydrolase(Homo sapiens (Human))
Weill Cornell Medical College
Curated by ChEMBL
LigandPNGBDBM50318693(4-(Pyrrolidin-1-yl)-1,2,5-thiadiazol-3-yl Piperidi...)
Affinity DataIC50:  496nM. Assay description: Inhibition of human LAL after 30 mins by fluorescence assay
In DepthDetails ArticlePubMed