BDBM50325373 4-(6-(3,4-dichlorobenzylamino)imidazo[1,2-b]pyridazin-3-yl)-N-(2-(pyrrolidin-1-yl)ethyl)benzamide::CHEMBL1222474
SMILES Clc1ccc(CNc2ccc3ncc(-c4ccc(cc4)C(=O)NCCN4CCCC4)n3n2)cc1Cl
InChI Key InChIKey=HERFSFFCWPWNME-UHFFFAOYSA-N
Data  7 IC50
  Tab Delimited (TSV)   2D SDfile   Computed 3D by Vconf -m prep SDfile
Find this compound or compounds like it in BindingDB:
Activity Spreadsheet -- Enzyme Inhibition Constant Data from BindingDB
Found 7 hits for monomerid = 50325373
TargetInhibitor of nuclear factor kappa-B kinase subunit alpha(Homo sapiens (Human))
Daiichi Sankyo
Curated by ChEMBL
LigandPNGBDBM50325373(4-(6-(3,4-dichlorobenzylamino)imidazo[1,2-b]pyrida...)
Affinity DataIC50:  4.60E+3nM. Assay description: Inhibition of recombinant IKKalpha after 15 mins
In DepthDetails ArticlePubMed
TargetCyclin-dependent kinase 2(Homo sapiens (Human))
Daiichi Sankyo
Curated by ChEMBL
LigandPNGBDBM50325373(4-(6-(3,4-dichlorobenzylamino)imidazo[1,2-b]pyrida...)
Affinity DataIC50: >1.00E+5nM. Assay description: Inhibition of recombinant CDK2 after 15 mins
In DepthDetails ArticlePubMed
LigandPNGBDBM50325373(4-(6-(3,4-dichlorobenzylamino)imidazo[1,2-b]pyrida...)
Affinity DataIC50: >1.00E+5nM. Assay description: Inhibition of recombinant PDK1 after 15 mins
In DepthDetails ArticlePubMed
TargetInhibitor of nuclear factor kappa-B kinase subunit beta(Homo sapiens (Human))
Daiichi Sankyo
Curated by ChEMBL
LigandPNGBDBM50325373(4-(6-(3,4-dichlorobenzylamino)imidazo[1,2-b]pyrida...)
Affinity DataIC50:  590nM. Assay description: Inhibition of purified His-tagged IKK-beta after 15 mins
In DepthDetails ArticlePubMed
TargetMitogen-activated protein kinase 10(Homo sapiens (Human))
Daiichi Sankyo
Curated by ChEMBL
LigandPNGBDBM50325373(4-(6-(3,4-dichlorobenzylamino)imidazo[1,2-b]pyrida...)
Affinity DataIC50:  9.00E+4nM. Assay description: Inhibition of recombinant JNK3 after 15 mins
In DepthDetails ArticlePubMed
TargetMitogen-activated protein kinase 14(Homo sapiens (Human))
Daiichi Sankyo
Curated by ChEMBL
LigandPNGBDBM50325373(4-(6-(3,4-dichlorobenzylamino)imidazo[1,2-b]pyrida...)
Affinity DataIC50: >1.00E+5nM. Assay description: Inhibition of recombinant p38alpha after 15 mins
In DepthDetails ArticlePubMed
TargetGlycogen synthase kinase-3 beta(Homo sapiens (Human))
Daiichi Sankyo
Curated by ChEMBL
LigandPNGBDBM50325373(4-(6-(3,4-dichlorobenzylamino)imidazo[1,2-b]pyrida...)
Affinity DataIC50: >1.00E+5nM. Assay description: Inhibition of recombinant GSK3-beta after 15 mins
In DepthDetails ArticlePubMed