BDBM50325376 CHEMBL1223564::N-(2-aminoethyl)-4-(6-(3,4-dichlorobenzylamino)imidazo[1,2-b]pyridazin-3-yl)benzamide
SMILES NCCNC(=O)c1ccc(cc1)-c1cnc2ccc(NCc3ccc(Cl)c(Cl)c3)nn12
InChI Key InChIKey=LDUBKHXRFKXHKV-UHFFFAOYSA-N
Data  1 IC50
  Tab Delimited (TSV)   2D SDfile   Computed 3D by Vconf -m prep SDfile
Find this compound or compounds like it in BindingDB:
Activity Spreadsheet -- Enzyme Inhibition Constant Data from BindingDB
Found 1 hit for monomerid = 50325376
TargetInhibitor of nuclear factor kappa-B kinase subunit beta(Homo sapiens (Human))
Daiichi Sankyo
Curated by ChEMBL
LigandPNGBDBM50325376(CHEMBL1223564 | N-(2-aminoethyl)-4-(6-(3,4-dichlor...)
Affinity DataIC50:  2.80E+3nM. Assay description: Inhibition of purified His-tagged IKK-beta after 15 mins
In DepthDetails ArticlePubMed