BDBM50325384 4-(6-(3,4-dichlorobenzylamino)imidazo[1,2-b]pyridazin-3-yl)-N-(piperidin-4-ylmethyl)benzamide::CHEMBL1222636
SMILES Clc1ccc(CNc2ccc3ncc(-c4ccc(cc4)C(=O)NCC4CCNCC4)n3n2)cc1Cl
InChI Key InChIKey=HAQTYQFMTMYMGX-UHFFFAOYSA-N
Data  1 IC50
  Tab Delimited (TSV)   2D SDfile   Computed 3D by Vconf -m prep SDfile
Find this compound or compounds like it in BindingDB:
Activity Spreadsheet -- Enzyme Inhibition Constant Data from BindingDB
Found 1 hit for monomerid = 50325384
TargetInhibitor of nuclear factor kappa-B kinase subunit beta(Homo sapiens (Human))
Daiichi Sankyo
Curated by ChEMBL
LigandPNGBDBM50325384(4-(6-(3,4-dichlorobenzylamino)imidazo[1,2-b]pyrida...)
Affinity DataIC50:  1.40E+4nM. Assay description: Inhibition of purified His-tagged IKK-beta after 15 mins
In DepthDetails ArticlePubMed