BDBM50325393 (4-(6-(3,4-dichlorobenzylamino)imidazo[1,2-b]pyridazin-3-yl)phenyl)(4-(pyrrolidin-1-yl)piperidin-1-yl)methanone::CHEMBL1222788
SMILES Clc1ccc(CNc2ccc3ncc(-c4ccc(cc4)C(=O)N4CCC(CC4)N4CCCC4)n3n2)cc1Cl
InChI Key InChIKey=VPRSRLNXKQKDLR-UHFFFAOYSA-N
Data  1 IC50
  Tab Delimited (TSV)   2D SDfile   Computed 3D by Vconf -m prep SDfile
Find this compound or compounds like it in BindingDB:
Activity Spreadsheet -- Enzyme Inhibition Constant Data from BindingDB
Found 1 hit for monomerid = 50325393
TargetInhibitor of nuclear factor kappa-B kinase subunit beta(Homo sapiens (Human))
Daiichi Sankyo
Curated by ChEMBL
LigandPNGBDBM50325393((4-(6-(3,4-dichlorobenzylamino)imidazo[1,2-b]pyrid...)
Affinity DataIC50:  1.40E+3nM. Assay description: Inhibition of purified His-tagged IKK-beta after 15 mins
In DepthDetails ArticlePubMed