BDBM50325402 (S)-4-(6-(isopropylamino)imidazo[1,2-b]pyridazin-3-yl)-N-(pyrrolidin-2-ylmethyl)benzamide::CHEMBL1222928
SMILES CC(C)Nc1ccc2ncc(-c3ccc(cc3)C(=O)NC[C@@H]3CCCN3)n2n1
InChI Key InChIKey=NPUFGTZUMWRJPQ-KRWDZBQOSA-N
Data  1 IC50
  Tab Delimited (TSV)   2D SDfile   Computed 3D by Vconf -m prep SDfile
Find this compound or compounds like it in BindingDB:
Activity Spreadsheet -- Enzyme Inhibition Constant Data from BindingDB
Found 1 hit for monomerid = 50325402
TargetInhibitor of nuclear factor kappa-B kinase subunit beta(Homo sapiens (Human))
Daiichi Sankyo
Curated by ChEMBL
LigandPNGBDBM50325402((S)-4-(6-(isopropylamino)imidazo[1,2-b]pyridazin-3...)
Affinity DataIC50:  270nM. Assay description: Inhibition of purified His-tagged IKK-beta after 15 mins
In DepthDetails ArticlePubMed