BDBM50325403 (S)-4-(6-(cyclopropylamino)imidazo[1,2-b]pyridazin-3-yl)-N-(pyrrolidin-2-ylmethyl)benzamide::CHEMBL1222929
SMILES O=C(NC[C@@H]1CCCN1)c1ccc(cc1)-c1cnc2ccc(NC3CC3)nn12
InChI Key InChIKey=YPTGGZAVFWQNCY-KRWDZBQOSA-N
Data  1 IC50
  Tab Delimited (TSV)   2D SDfile   Computed 3D by Vconf -m prep SDfile
Find this compound or compounds like it in BindingDB:
Activity Spreadsheet -- Enzyme Inhibition Constant Data from BindingDB
Found 1 hit for monomerid = 50325403
TargetInhibitor of nuclear factor kappa-B kinase subunit beta(Homo sapiens (Human))
Daiichi Sankyo
Curated by ChEMBL
LigandPNGBDBM50325403((S)-4-(6-(cyclopropylamino)imidazo[1,2-b]pyridazin...)
Affinity DataIC50:  200nM. Assay description: Inhibition of purified His-tagged IKK-beta after 15 mins
In DepthDetails ArticlePubMed