BDBM50325412 CHEMBL1223206::N-(2-aminopropyl)-4-(6-(cyclopropylmethylamino)imidazo[1,2-b]pyridazin-3-yl)benzamide
SMILES CC(N)CNC(=O)c1ccc(cc1)-c1cnc2ccc(NCC3CC3)nn12
InChI Key InChIKey=RQZWXMOPEGDGAD-UHFFFAOYSA-N
Data  1 IC50
  Tab Delimited (TSV)   2D SDfile   Computed 3D by Vconf -m prep SDfile
Find this compound or compounds like it in BindingDB:
Activity Spreadsheet -- Enzyme Inhibition Constant Data from BindingDB
Found 1 hit for monomerid = 50325412
TargetInhibitor of nuclear factor kappa-B kinase subunit beta(Homo sapiens (Human))
Daiichi Sankyo
Curated by ChEMBL
LigandPNGBDBM50325412(CHEMBL1223206 | N-(2-aminopropyl)-4-(6-(cyclopropy...)
Affinity DataIC50:  310nM. Assay description: Inhibition of purified His-tagged IKK-beta after 15 mins
In DepthDetails ArticlePubMed