BDBM50325959 CHEMBL1223966::N-(3-(1-(3-(1-(4-cyanobenzyl)-1H-benzo[d]imidazol-2-ylamino)propyl)piperidin-4-yl)phenyl)acetamide
SMILES CC(=O)Nc1cccc(c1)C1CCN(CCCNc2nc3ccccc3n2Cc2ccc(cc2)C#N)CC1
InChI Key InChIKey=AJAYHXDWVNTBJG-UHFFFAOYSA-N
Data  1 IC50
  Tab Delimited (TSV)   2D SDfile   Computed 3D by Vconf -m prep SDfile
Find this compound or compounds like it in BindingDB:
Activity Spreadsheet -- Enzyme Inhibition Constant Data from BindingDB
Found 1 hit for monomerid = 50325959
TargetMelanin-concentrating hormone receptor 1(Homo sapiens (Human))
Dr. Reddy'S Laboratories
Curated by ChEMBL
LigandPNGBDBM50325959(CHEMBL1223966 | N-(3-(1-(3-(1-(4-cyanobenzyl)-1H-b...)
Affinity DataIC50:  38nM. Assay description: Displacement of [125I]MCH from human recombinant MCHR1 expressed in CHOK1 cells by scintillation proximity assay
In DepthDetails ArticlePubMed