BDBM50326389 2-[(3S,5S)-5-{[(2S)-2-Cyanopyrrolidin-1-yl]carbonyl}-2-oxopyrrolidin-3-yl]-N-phenylacetamide::CHEMBL1243093
SMILES O=C(C[C@@H]1C[C@H](NC1=O)C(=O)N1CCC[C@H]1C#N)Nc1ccccc1
InChI Key InChIKey=OOPZADVYFLNXCP-QEJZJMRPSA-N
Data  5 IC50
  Tab Delimited (TSV)   2D SDfile   Computed 3D by Vconf -m prep SDfile
Find this compound or compounds like it in BindingDB:
Activity Spreadsheet -- Enzyme Inhibition Constant Data from BindingDB
Found 5 hits for monomerid = 50326389
TargetDipeptidyl peptidase 8(Homo sapiens (Human))
National Health Research Institutes
Curated by ChEMBL
LigandPNGBDBM50326389(2-[(3S,5S)-5-{[(2S)-2-Cyanopyrrolidin-1-yl]carbony...)
Affinity DataIC50: >1.00E+5nM. Assay description: Inhibition of human recombinant His-tagged DPP8 expressed in insect cells
In DepthDetails ArticlePubMed
TargetDipeptidyl peptidase 9(Homo sapiens (Human))
National Health Research Institutes
Curated by ChEMBL
LigandPNGBDBM50326389(2-[(3S,5S)-5-{[(2S)-2-Cyanopyrrolidin-1-yl]carbony...)
Affinity DataIC50: >1.00E+5nM. Assay description: Inhibition of human recombinant His-tagged DPP9 expressed in insect cells
In DepthDetails ArticlePubMed
TargetProlyl endopeptidase FAP(Homo sapiens (Human))
National Health Research Institutes
Curated by ChEMBL
LigandPNGBDBM50326389(2-[(3S,5S)-5-{[(2S)-2-Cyanopyrrolidin-1-yl]carbony...)
Affinity DataIC50: >2.00E+4nM. Assay description: Inhibition of human recombinant FAP expressed in Hi5 insect cells
In DepthDetails ArticlePubMed
TargetDipeptidyl peptidase 4(Homo sapiens (Human))
National Health Research Institutes
Curated by ChEMBL
LigandPNGBDBM50326389(2-[(3S,5S)-5-{[(2S)-2-Cyanopyrrolidin-1-yl]carbony...)
Affinity DataIC50: >1.00E+5nM. Assay description: Inhibition of human recombinant His-tagged DPP4 expressed in insect cells
In DepthDetails ArticlePubMed
TargetDipeptidyl peptidase 2(Homo sapiens (Human))
National Health Research Institutes
Curated by ChEMBL
LigandPNGBDBM50326389(2-[(3S,5S)-5-{[(2S)-2-Cyanopyrrolidin-1-yl]carbony...)
Affinity DataIC50: >1.00E+5nM. Assay description: Inhibition of human recombinant His-tagged DPP2 expressed in insect cells
In DepthDetails ArticlePubMed