BDBM50326395 (2R)-1-{(2S, 4S)-4-[2-(1,3-Dihydroisoindol-2-yl)-2-oxoethyl]-5-oxopyrrolidine-2-carbonyl}pyrrolidine-2-boronic Acid::CHEMBL1243184
SMILES OB(O)[C@@H]1CCCN1C(=O)[C@@H]1C[C@@H](CC(=O)N2Cc3ccccc3C2)C(=O)N1
InChI Key InChIKey=ITLZQNVDXDVBBF-JYJNAYRXSA-N
Data  5 IC50
  Tab Delimited (TSV)   2D SDfile   Computed 3D by Vconf -m prep SDfile
Find this compound or compounds like it in BindingDB:
Activity Spreadsheet -- Enzyme Inhibition Constant Data from BindingDB
Found 5 hits for monomerid = 50326395
TargetProlyl endopeptidase FAP(Homo sapiens (Human))
National Health Research Institutes
Curated by ChEMBL
LigandPNGBDBM50326395((2R)-1-{(2S, 4S)-4-[2-(1,3-Dihydroisoindol-2-yl)-2...)
Affinity DataIC50:  31nM. Assay description: Inhibition of human recombinant FAP expressed in Hi5 insect cells
In DepthDetails ArticlePubMed
TargetDipeptidyl peptidase 8(Homo sapiens (Human))
National Health Research Institutes
Curated by ChEMBL
LigandPNGBDBM50326395((2R)-1-{(2S, 4S)-4-[2-(1,3-Dihydroisoindol-2-yl)-2...)
Affinity DataIC50:  500nM. Assay description: Inhibition of human recombinant His-tagged DPP8 expressed in insect cells
In DepthDetails ArticlePubMed
TargetDipeptidyl peptidase 4(Homo sapiens (Human))
National Health Research Institutes
Curated by ChEMBL
LigandPNGBDBM50326395((2R)-1-{(2S, 4S)-4-[2-(1,3-Dihydroisoindol-2-yl)-2...)
Affinity DataIC50:  570nM. Assay description: Inhibition of human recombinant His-tagged DPP4 expressed in insect cells
In DepthDetails ArticlePubMed
TargetDipeptidyl peptidase 2(Homo sapiens (Human))
National Health Research Institutes
Curated by ChEMBL
LigandPNGBDBM50326395((2R)-1-{(2S, 4S)-4-[2-(1,3-Dihydroisoindol-2-yl)-2...)
Affinity DataIC50:  400nM. Assay description: Inhibition of human recombinant His-tagged DPP2 expressed in insect cells
In DepthDetails ArticlePubMed
TargetDipeptidyl peptidase 9(Homo sapiens (Human))
National Health Research Institutes
Curated by ChEMBL
LigandPNGBDBM50326395((2R)-1-{(2S, 4S)-4-[2-(1,3-Dihydroisoindol-2-yl)-2...)
Affinity DataIC50:  520nM. Assay description: Inhibition of human recombinant His-tagged DPP9 expressed in insect cells
In DepthDetails ArticlePubMed