BDBM50328465 5-Chloro-N-[8-({[5-(dimethylamino)-1-naphthyl]sulfonyl}amino)-octyl]-N-(4-methoxy-3-piperazin-1-ylphenyl)-3-methyl-1-benzothiophene-2-sulfonamide::CHEMBL1256254
SMILES COc1ccc(cc1N1CCNCC1)N(CCCCCCCCNS(=O)(=O)c1cccc2c(cccc12)N(C)C)S(=O)(=O)c1sc2ccc(Cl)cc2c1C
InChI Key InChIKey=UWWUPWHJJGQRAH-UHFFFAOYSA-N
Data  1 KI
  Tab Delimited (TSV)   2D SDfile   Computed 3D by Vconf -m prep SDfile
Find this compound or compounds like it in BindingDB:
Activity Spreadsheet -- Enzyme Inhibition Constant Data from BindingDB
Found 1 hit for monomerid = 50328465
Target5-hydroxytryptamine receptor 6(Homo sapiens (Human))
Universidad Complutense De Madrid
Curated by ChEMBL
LigandPNGBDBM50328465(5-Chloro-N-[8-({[5-(dimethylamino)-1-naphthyl]sulf...)
Affinity DataKi:  215nM. Assay description: Displacement of [3H]LSD from human 5HT6 receptor expressed in HEK293 cells
In DepthDetails ArticlePubMed