BDBM50328466 5-Chloro-N-(4-{[8-({[5-(dimethylamino)-1-naphthyl]sulfonyl}-amino)octyl]oxy}-3-piperazin-1-ylphenyl)-3-methyl-1-benzothiophene-2-sulfonamide::CHEMBL1256255
SMILES CN(C)c1cccc2c(cccc12)S(=O)(=O)NCCCCCCCCOc1ccc(NS(=O)(=O)c2sc3ccc(Cl)cc3c2C)cc1N1CCNCC1
InChI Key InChIKey=AJFCFFCXDVYDDM-UHFFFAOYSA-N
Data  1 KI
  Tab Delimited (TSV)   2D SDfile   Computed 3D by Vconf -m prep SDfile
Find this compound or compounds like it in BindingDB:
Activity Spreadsheet -- Enzyme Inhibition Constant Data from BindingDB
Found 1 hit for monomerid = 50328466
Target5-hydroxytryptamine receptor 6(Homo sapiens (Human))
Universidad Complutense De Madrid
Curated by ChEMBL
LigandPNGBDBM50328466(5-Chloro-N-(4-{[8-({[5-(dimethylamino)-1-naphthyl]...)
Affinity DataKi:  741nM. Assay description: Displacement of [3H]LSD from human 5HT6 receptor expressed in HEK293 cells
In DepthDetails ArticlePubMed