BDBM50330418 CHEMBL1276246::N,N'-(heptane-1,7-diyl)dipropane-2-sulfonamide
SMILES CC(C)S(=O)(=O)NCCCCCCCNS(=O)(=O)C(C)C
InChI Key InChIKey=LIMYKOPCOXOSMN-UHFFFAOYSA-N
Data  1 EC50
  Tab Delimited (TSV)   2D SDfile   Computed 3D by Vconf -m prep SDfile
Find this compound or compounds like it in BindingDB:
Activity Spreadsheet -- Enzyme Inhibition Constant Data from BindingDB
Found 1 hit for monomerid = 50330418
TargetGlutamate receptor 1(Homo sapiens (Human))
Merck Research Laboratories
Curated by ChEMBL
LigandPNGBDBM50330418(CHEMBL1276246 | N,N'-(heptane-1,7-diyl)dipropane-2...)
Affinity DataEC50:  2.88E+3nM. Assay description: Inhibition of GluR1 expressed in HEK cells
In DepthDetails ArticlePubMed