BDBM50341416 CHEMBL4174909::US11534443, Example 32
SMILES CNc1nc(C)c2cc(cc(O[C@@H]3CCOC3)c2n1)-c1cnc(OC)c(NS(=O)(=O)c2ccc(F)cc2F)c1
InChI Key InChIKey=DVLVYFPEVHXTKT-GOSISDBHSA-N
Data  14 IC50
  Tab Delimited (TSV)   2D SDfile   Computed 3D by Vconf -m prep SDfile
Find this compound or compounds like it in BindingDB:
Activity Spreadsheet -- Enzyme Inhibition Constant Data from BindingDB
Found 14 hits for monomerid = 50341416
TargetPhosphatidylinositol 4,5-bisphosphate 3-kinase catalytic subunit alpha isoform(Homo sapiens (Human))
Chinese Academy Of Medical Sciences And Peking Union Medical College
Curated by ChEMBL
LigandPNGBDBM50341416(CHEMBL4174909 | US11534443, Example 32)
Affinity DataIC50:  0.960nM. Assay description: Inhibition of PI3Kalpha (unknown origin) using PIP2 as substrate by Kinase-Glo assay
In DepthDetails ArticlePubMed
TargetCytochrome P450 1A2(Homo sapiens (Human))
Chinese Academy Of Medical Sciences And Peking Union Medical College
Curated by ChEMBL
LigandPNGBDBM50341416(CHEMBL4174909 | US11534443, Example 32)
Affinity DataIC50: >1.00E+4nM. Assay description: Inhibition of CYP1A2 in human liver microsomes assessed as reduction in acetaminophen formation using phenacetin as substrate after 10 to 20 mins in ...
In DepthDetails ArticlePubMed
TargetPhosphatidylinositol 4,5-bisphosphate 3-kinase catalytic subunit delta isoform(Homo sapiens (Human))
Chinese Academy Of Medical Sciences And Peking Union Medical College
Curated by ChEMBL
LigandPNGBDBM50341416(CHEMBL4174909 | US11534443, Example 32)
Affinity DataIC50:  0.370nM. Assay description: Inhibition of PI3Kdelta (unknown origin) using PIP2 as substrate by ADP-Glo assay
In DepthDetails ArticlePubMed
TargetPotassium voltage-gated channel subfamily H member 2(Homo sapiens (Human))
Chinese Academy Of Medical Sciences And Peking Union Medical College
Curated by ChEMBL
LigandPNGBDBM50341416(CHEMBL4174909 | US11534443, Example 32)
Affinity DataIC50: >1.00E+4nM. Assay description: Inhibition of human ERG expressed in CHO cell membranes by patch clamp method
In DepthDetails ArticlePubMed
TargetCytochrome P450 2C9(Homo sapiens (Human))
Chinese Academy Of Medical Sciences And Peking Union Medical College
Curated by ChEMBL
LigandPNGBDBM50341416(CHEMBL4174909 | US11534443, Example 32)
Affinity DataIC50: >1.00E+4nM. Assay description: Inhibition of CYP2C9 in human liver microsomes assessed as reduction in 4-Hydroxydiclofenac formation using diclofenac as substrate after 10 to 20 mi...
In DepthDetails ArticlePubMed
TargetCytochrome P450 2C19(Homo sapiens (Human))
Chinese Academy Of Medical Sciences And Peking Union Medical College
Curated by ChEMBL
LigandPNGBDBM50341416(CHEMBL4174909 | US11534443, Example 32)
Affinity DataIC50: >1.00E+4nM. Assay description: Inhibition of CYP2C19 in human liver microsomes assessed as reduction in 4-Hydroxymephenytoinn formation using mephenytoin as substrate after 10 to 2...
In DepthDetails ArticlePubMed
TargetPhosphatidylinositol 4-phosphate 3-kinase C2 domain-containing subunit alpha(Homo sapiens (Human))
Institute of Materia Medica, Chinese Academy of Medical Sciences
US Patent
LigandPNGBDBM50341416(CHEMBL4174909 | US11534443, Example 32)
Affinity DataIC50:  0.820nM. Assay description: The Kinase-Glo™ Kinase Assay Kit was purchased from Promega. All assays were performed at room temperature using white OptiPlate™-384 well plate. The...
In DepthDetails US Patent
TargetCytochrome P450 3A4(Homo sapiens (Human))
Chinese Academy Of Medical Sciences And Peking Union Medical College
Curated by ChEMBL
LigandPNGBDBM50341416(CHEMBL4174909 | US11534443, Example 32)
Affinity DataIC50: >1.00E+4nM. Assay description: Inhibition of CYP3A4 in human liver microsomes assessed as reduction in 1-Hydroxymidazolam formation using midazolam as substrate after 10 to 20 mins...
In DepthDetails ArticlePubMed
TargetCytochrome P450 2E1(Homo sapiens (Human))
Chinese Academy Of Medical Sciences And Peking Union Medical College
Curated by ChEMBL
LigandPNGBDBM50341416(CHEMBL4174909 | US11534443, Example 32)
Affinity DataIC50: >1.00E+4nM. Assay description: Inhibition of CYP2E1 in human liver microsomes assessed as reduction in 6-Hydroxychlorzoxazone formation using chlorzoxazone as substrate after 10 to...
In DepthDetails ArticlePubMed
TargetPhosphatidylinositol 4,5-bisphosphate 3-kinase catalytic subunit beta isoform(Homo sapiens (Human))
Chinese Academy Of Medical Sciences And Peking Union Medical College
Curated by ChEMBL
LigandPNGBDBM50341416(CHEMBL4174909 | US11534443, Example 32)
Affinity DataIC50:  1.10nM. Assay description: Inhibition of PI3Kbeta (unknown origin) using PIP2 as substrate by ADP-Glo assay
In DepthDetails ArticlePubMed
TargetPhosphatidylinositol 4,5-bisphosphate 3-kinase catalytic subunit gamma isoform(Homo sapiens (Human))
Chinese Academy Of Medical Sciences And Peking Union Medical College
Curated by ChEMBL
LigandPNGBDBM50341416(CHEMBL4174909 | US11534443, Example 32)
Affinity DataIC50:  0.930nM. Assay description: Inhibition of PI3Kgamma (unknown origin) using PIP2 as substrate by ADP-Glo assay
In DepthDetails ArticlePubMed
TargetRAC-alpha serine/threonine-protein kinase(Homo sapiens (Human))
Chinese Academy Of Medical Sciences And Peking Union Medical College
Curated by ChEMBL
LigandPNGBDBM50341416(CHEMBL4174909 | US11534443, Example 32)
Affinity DataIC50: >1.00E+4nM. Assay description: Inhibition of AKT1 (unknown origin) using FAM-labeled peptide as substrate by mobility shift assay
In DepthDetails ArticlePubMed
TargetSerine/threonine-protein kinase mTOR(Homo sapiens (Human))
Chinese Academy Of Medical Sciences And Peking Union Medical College
Curated by ChEMBL
LigandPNGBDBM50341416(CHEMBL4174909 | US11534443, Example 32)
Affinity DataIC50:  56nM. Assay description: Inhibition of mTOR (unknown origin) using ULight-4E-BP1 peptide as substrate after 30 mins by Lance Ultra assay
In DepthDetails ArticlePubMed
TargetCytochrome P450 2D6(Homo sapiens (Human))
Chinese Academy Of Medical Sciences And Peking Union Medical College
Curated by ChEMBL
LigandPNGBDBM50341416(CHEMBL4174909 | US11534443, Example 32)
Affinity DataIC50: >1.00E+4nM. Assay description: Inhibition of CYP2D6 in human liver microsomes assessed as reduction in dextrophan formation using detromethorphann as substrate after 10 to 20 mins ...
In DepthDetails ArticlePubMed