BDBM50341985 CHEMBL1765366
SMILES [O-][N+](=O)c1ccc2N(Cc3cccc(F)c3)C(=O)[C@@]3(N(C(=O)CS3(=O)=O)c3ccc(F)c(F)c3)c2c1
InChI Key InChIKey=AUHGGVZFLXRGCP-HSZRJFAPSA-N
Data  1 KI  1 IC50
  Tab Delimited (TSV)   2D SDfile   Computed 3D by Vconf -m prep SDfile
Find this compound or compounds like it in BindingDB:
Activity Spreadsheet -- Enzyme Inhibition Constant Data from BindingDB
Found 2 hits for monomerid = 50341985
TargetTYR_PHOSPHATASE_2 domain-containing protein(Mycobacterium tuberculosis)
Max Planck Institute Of Molecular Physiology
Curated by ChEMBL
LigandPNGBDBM50341985(CHEMBL1765366)
Affinity DataKi:  250nM. Assay description: Inhibition of Mycobacterium tuberculosis ptpB
In DepthDetails ArticlePubMed
TargetTYR_PHOSPHATASE_2 domain-containing protein(Mycobacterium tuberculosis)
Max Planck Institute Of Molecular Physiology
Curated by ChEMBL
LigandPNGBDBM50341985(CHEMBL1765366)
Affinity DataIC50:  320nM. Assay description: Inhibition of Mycobacterium tuberculosis ptpB
In DepthDetails ArticlePubMed