BDBM50343205 CHEMBL1773606::N-(6-(6-Chloro-5-(2-(trifluoromethyl)phenylsulfonamido)pyridin-3-yl)benzo[d]thiazol-2-yl)acetamide
SMILES CC(=O)Nc1nc2ccc(cc2s1)-c1cnc(Cl)c(NS(=O)(=O)c2ccccc2C(F)(F)F)c1
InChI Key InChIKey=KPJPCGHPNIPOEU-UHFFFAOYSA-N
Data  1 KI  2 IC50
  Tab Delimited (TSV)   2D SDfile   Computed 3D by Vconf -m prep SDfile
Find this compound or compounds like it in BindingDB:
Activity Spreadsheet -- Enzyme Inhibition Constant Data from BindingDB
Found 3 hits for monomerid = 50343205
LigandPNGBDBM50343205(CHEMBL1773606 | N-(6-(6-Chloro-5-(2-(trifluorometh...)
Affinity DataKi: <1nM. Assay description: Inhibition of human PI3Kalpha expressed in Sf9 cells
In DepthDetails ArticlePubMed
TargetRAC-alpha serine/threonine-protein kinase(Homo sapiens (Human))
Amgen
Curated by ChEMBL
LigandPNGBDBM50343205(CHEMBL1773606 | N-(6-(6-Chloro-5-(2-(trifluorometh...)
Affinity DataIC50:  8nM. Assay description: Inhibition of AKT phosphorylation at S473 in human U-87MG cells at 5 mM after 2 hrs
In DepthDetails ArticlePubMed
TargetSerine/threonine-protein kinase mTOR(Homo sapiens (Human))
Amgen
Curated by ChEMBL
LigandPNGBDBM50343205(CHEMBL1773606 | N-(6-(6-Chloro-5-(2-(trifluorometh...)
Affinity DataIC50: <1nM. Assay description: Inhibition of mTOR assessed as inhibition of 4EBP1 phosphorylation by TR-FRET assay
In DepthDetails ArticlePubMed