BDBM50345543 CHEMBL1784375::Cryptocaryol D
SMILES CCCCCCCCCCCCCCC[C@H](C[C@H](O)C[C@H](O)C[C@H](O)C[C@H](O)C[C@@H]1OC(=O)C=C[C@@H]1O)OC(C)=O
InChI Key InChIKey=QTODHKJVJUSIHI-YEWNYCFTSA-N
Data  1 EC50
  Tab Delimited (TSV)   2D SDfile   Computed 3D by Vconf -m prep SDfile
Find this compound or compounds like it in BindingDB:
Activity Spreadsheet -- Enzyme Inhibition Constant Data from BindingDB
Found 1 hit for monomerid = 50345543
TargetProgrammed cell death protein 4(Homo sapiens (Human))
National Cancer Institute-Frederick
Curated by ChEMBL
LigandPNGBDBM50345543(CHEMBL1784375 | Cryptocaryol D)
Affinity DataEC50:  1.50E+3nM. Assay description: Inhibition of TPA-induced degradation of Pdcd4 (amino acid 39-91) expressed in human HEK293 cells assessed as minimum compound concentration required...
In DepthDetails ArticlePubMed