BDBM50345544 CHEMBL1784376::Cryptocaryol E
SMILES CCCCCCCCCCCCCCC[C@@H](O)C[C@H](O)C[C@H](O)C[C@H](O)C[C@@H]1OC(=O)C=C[C@@H]1O
InChI Key InChIKey=CVJWXRNBYKUGQI-AIFRIFMOSA-N
Data  1 EC50
  Tab Delimited (TSV)   2D SDfile   Computed 3D by Vconf -m prep SDfile
Find this compound or compounds like it in BindingDB:
Activity Spreadsheet -- Enzyme Inhibition Constant Data from BindingDB
Found 1 hit for monomerid = 50345544
TargetProgrammed cell death protein 4(Homo sapiens (Human))
National Cancer Institute-Frederick
Curated by ChEMBL
LigandPNGBDBM50345544(CHEMBL1784376 | Cryptocaryol E)
Affinity DataEC50:  1.80E+3nM. Assay description: Inhibition of TPA-induced degradation of Pdcd4 (amino acid 39-91) expressed in human HEK293 cells assessed as minimum compound concentration required...
In DepthDetails ArticlePubMed