BDBM50345699 5-(Dimethylamino)-N-[5-({4-[2-{4-[4-(2-methoxyphenyl)piperazin-1-yl]butyl}-1,3-dioxotetrahydro-1H-pyrrolo[1,2-c]imidazol-7a(5H)-yl]butyl}amino)pentyl]naphthalene-1-sulfonamide::CHEMBL1784935
SMILES COc1ccccc1N1CCN(CCCCN2C(=O)N3CCCC3(CCCCNCCCCCNS(=O)(=O)c3cccc4c(cccc34)N(C)C)C2=O)CC1
InChI Key InChIKey=ULTXEZOVYZCVSW-UHFFFAOYSA-N
Data  1 KI
  Tab Delimited (TSV)   2D SDfile   Computed 3D by Vconf -m prep SDfile
Find this compound or compounds like it in BindingDB:
Activity Spreadsheet -- Enzyme Inhibition Constant Data from BindingDB
Found 1 hit for monomerid = 50345699
Target5-hydroxytryptamine receptor 1A(Homo sapiens (Human))
TBA
Curated by ChEMBL
LigandPNGBDBM50345699(5-(Dimethylamino)-N-[5-({4-[2-{4-[4-(2-methoxyphen...)
Affinity DataKi:  9nM. Assay description: Displacement of [3H]8-OH-DPAT from human 5HT1A receptor expressed in EBNA gene-positive HEK293 cells after 120 mins
In DepthDetails ArticlePubMed