BDBM50350515 CHEMBL1812067
SMILES Nc1ncnc2n(cnc12)[C@@H]1O[C@H](COP(S)(=O)OCC(COP(O)(S)=O)(COP(S)(=O)OC[C@H]2O[C@H]([C@H](O)[C@@H]2O)n2cnc3c(N)ncnc23)COP(S)(=O)OC[C@H]2O[C@H]([C@H](O)[C@@H]2O)n2cnc3c(N)ncnc23)[C@@H](O)[C@H]1O
InChI Key InChIKey=YGEUMMZTPBVMQP-CFWAMSQASA-N
Data  1 KI
  Tab Delimited (TSV)   2D SDfile   Computed 3D by Vconf -m prep SDfile
Find this compound or compounds like it in BindingDB:
Activity Spreadsheet -- Enzyme Inhibition Constant Data from BindingDB
Found 1 hit for monomerid = 50350515
TargetBis(5'-adenosyl)-triphosphatase(Homo sapiens (Human))
Polish Academy Of Sciences
Curated by ChEMBL
LigandPNGBDBM50350515(CHEMBL1812067)
Affinity DataKi:  35nM. Assay description: Inhibition of Fragile histidine triad prorein hydrolytic activity
In DepthDetails ArticlePubMed