BDBM50351923 CHEMBL1821814
SMILES CC(Cc1cc2cc(ccc2nc1N)-c1ccccc1C)C(=O)NCC1CCCCC1
InChI Key InChIKey=MQOILMOKFLJWRN-UHFFFAOYSA-N
Data  1 IC50
  Tab Delimited (TSV)   2D SDfile   Computed 3D by Vconf -m prep SDfile
Find this compound or compounds like it in BindingDB:
Activity Spreadsheet -- Enzyme Inhibition Constant Data from BindingDB
Found 1 hit for monomerid = 50351923
TargetBeta-secretase 1(Homo sapiens (Human))
Amgen
Curated by ChEMBL
LigandPNGBDBM50351923(CHEMBL1821814)
Affinity DataIC50:  3.70nM. Assay description: Inhibition of human recombinant BACE1 after 60 mins by FRET assay
In DepthDetails ArticlePubMed